{"text_format":"1","workbook":"xlsx","n_sheets":21,"sheets":["Инструкция","Титульный","Список листов","ТС цены","ТС цены (2)","ТС характеристики","ТС инвестиции","ТС доступ","ТС показатели","Ссылки на публикации","Проверка","REESTR_START","REESTR_ORG","REESTR_TEMP","REESTR","TEHSHEET","tech","modHyp","modChange","modButtonClick","modSubsidiary"],"not_rendered":{"charts":0,"images":6,"macros":1,"external_links":1,"defined_names":103,"comments":0,"pivot_tables":0},"unopened":[],"bounds":{"document_bytes":16777216,"sheet_cells":100000,"rows_first":2000,"rows_last":500,"rows_between":2000,"halvings":0,"cell_chars":16384,"cell_head_chars":4096},"cells_cut":0,"cells_raw":0,"read":"whole","date_system":"1900"}

{"sheet":"Инструкция","index":0,"n_rows":54,"n_cols":16,"rows_kept":54,"cut":false,"hidden":false,"merged":[[53,2,53,3],[53,4,53,10],[44,2,44,3],[44,4,44,10],[45,2,45,3],[45,4,45,10],[46,2,46,3],[46,4,46,10],[48,2,48,7],[49,2,49,3],[50,2,50,3],[50,4,50,10],[51,2,51,3],[51,4,51,10],[52,2,52,3],[52,4,52,10],[1,15,1,16],[2,2,2,15],[4,2,4,7],[41,2,41,7],[5,2,5,7],[49,4,49,10],[42,2,42,3],[42,4,42,10],[43,2,43,3],[43,4,43,10]]}
[]
[null,null,null,null,null,null,null,null,null,null,null,null,null,null,null,{"$f":"\"Версия \" & GetVersion()","v":"Версия 3.0"}]
[null,null,"Инструкция по заполнению шаблона"]
[]
[null,null,"Субъект РФ"]
[null,null,"Удмуртская республика"]
[]
[]
[]
[]
[]
[]
[]
[]
[]
[]
[]
[]
[]
[]
[]
[]
[]
[]
[]
[]
[]
[]
[]
[]
{"$rows_left_out":25}
{"sheet":"Титульный","index":1,"n_rows":35,"n_cols":8,"rows_kept":35,"cut":false,"hidden":false,"merged":[[22,4,23,4],[19,5,19,6],[20,5,20,6],[2,6,2,7],[3,4,3,6],[5,4,5,5],[6,4,6,5],[12,5,12,6],[14,5,14,6],[31,4,34,4],[25,4,25,5],[27,4,28,4],[29,4,30,4],[26,4,26,5]]}
[{"$f":"region_name","v":"Удмуртская республика"},{"$f":"IF(god=\"\",\"Не определено\",god)","v":"2012"},{"$f":"org&\"_INN:\"&inn&\"_KPP:\"&kpp","v":"ООО \"МЕЧЕЛ-ЭНЕРГО\"_INN:7722245108_KPP:183232001"}]
[{"$f":"IF(org=\"\",\"Не определено\",org)","v":"ООО \"МЕЧЕЛ-ЭНЕРГО\""},{"$f":"IF(inn=\"\",\"Не определено\",inn)","v":"7722245108"}]
[{"$f":"IF(mo=\"\",\"Не определено\",mo)","v":"г. Ижевск"},{"$f":"IF(oktmo=\"\",\"Не определено\",oktmo)","v":"94701000"},null,null,null,null,{"$f":"version","v":"Версия 3.0"}]
[{"$f":"IF(fil=\"\",\"Не определено\",fil)","v":"Не определено"},{"$f":"IF(kpp=\"\",\"Не определено\",kpp)","v":"183232001"},null,null,"Показатели подлежащие раскрытию в сфере теплоснабжения и сфере оказания услуг по передаче тепловой энергии"]
[]
[null,null,null,null,"Субъект РФ"]
[null,null,null,null,"Удмуртская республика"]
[]
[null,null,null,null,"Отчетный год:","2012","Отчетный квартал:","Год"]
[]
["L0","Признак филиала",null,null,"Является ли данное юридическое лицо подразделением(филиалом) другой организации","нет","Тип предоставляемых данных:","ПЛАН"]
[132]
[null,null,null,null,"Наименование организации","ООО \"МЕЧЕЛ-ЭНЕРГО\""]
[]
[null,null,null,null,"Наименование ПОДРАЗДЕЛЕНИЯ",null,null,"(заполняется, \nесли в ячейке \"F11\" - \"да\")"]
[]
[null,null,null,null,"ИНН организации","7722245108",null,"Наличие 2-ставочного тарифа"]
[null,null,null,null,"КПП организации","183232001",null,"Нет"]
[]
[null,null,null,null,"Вид деятельности","производство (некомбинированная выработка)+передача",null,"Вид тарифа на передачу тепловой энергии"]
[null,null,null,null,"НДС","Отчетность представлена без НДС",null,"руб./Гкал"]
[null,null,null,null,"Муниципальный район, на территории которого осуществляет деятельность данная ОРГАНИЗАЦИЯ","Наименование МР","Удмуртская Республика"]
[null,null,null,null,"Муниципальное образование, на территории которого осуществляет деятельность данная ОРГАНИЗАЦИЯ","Наименование","г. Ижевск","(выберите из списка)"]
[null,null,null,null,null,"ОКТМО","94701000"]
[]
["L1.1","Юридический адрес",null,null,"Юридический адрес",null,"125993, РФ, Москва, ул. Красноармейская, д.1"]
["L1.2","Почтовый адрес",null,null,"Почтовый адрес",null,"426006, УР, г. Ижевск, ул. Новоажимова, д.6"]
["L2.1","Руководитель.ФИО",null,null,"Руководитель","Фамилия, имя, отчество","Чернаков Анатолий Михайлович"]
["L2.2","Руководитель.Телефон",null,null,null,"Контактный телефон"]
["L3.1","Гл.бухгалтер.ФИО",null,null,"Главный бухгалтер","Фамилия, имя, отчество","Гаврюшина Светлана Александровна"]
{"$rows_left_out":6}
{"sheet":"Список листов","index":2,"n_rows":9,"n_cols":4,"rows_kept":9,"cut":false,"hidden":false,"merged":[]}
[]
[null,"Лист","Заголовок листа","Ссылка"]
[null,"ТС цены",{"$f":"'ТС цены'!$E$10","v":"Информация о ценах (тарифах) на регулируемые товары и услуги и надбавках к этим ценам (тарифам)"},"Перейти на лист"]
[null,"ТС цены (2)",{"$f":"'ТС цены (2)'!E10","v":"Информация о ценах (тарифах) на регулируемые товары и услуги и надбавках к этим ценам (тарифам)"},"Перейти на лист"]
[null,"ТС характеристики",{"$f":"'ТС характеристики'!$E$10","v":"Информация об основных потребительских характеристиках регулируемых товаров и услуг регулируемых организаций и их соответствии государственным и иным утвержденным стандартам качества"},"Перейти на лист"]
[null,"ТС инвестиции",{"$f":"'ТС инвестиции'!$E$10","v":"Информация об инвестиционных программах и отчетах об их реализации"},"Перейти на лист"]
[null,"ТС доступ",{"$f":"'ТС доступ'!$E$10","v":"Информация о наличии (отсутствии) технической возможности доступа к регулируемым товарам и услугам регулируемых организаций, а также о регистрации и ходе реализации заявок на подключение к системе теплоснабжения"},"Перейти на лист"]
[null,"ТС показатели",{"$f":"'ТС показатели'!$E$10","v":"Информация об основных показателях финансово-хозяйственной деятельности регулируемых организаций, включая структуру основных производственных затрат (в части регулируемой деятельности)"},"Перейти на лист"]
[null,"Ссылки на публикации",{"$f":"'Ссылки на публикации'!E10","v":"Ссылки на публикации в других источниках"},"Перейти на лист"]

{"sheet":"ТС цены","index":3,"n_rows":32,"n_cols":24,"rows_kept":32,"cut":false,"hidden":false,"merged":[[11,22,13,22],[11,23,13,23],[9,4,9,23],[14,5,14,6],[11,4,13,4],[11,19,13,19],[11,20,13,20],[11,21,13,21],[11,10,11,12],[11,13,11,15],[11,16,11,18],[12,7,13,7],[12,10,13,10],[12,16,13,16],[12,17,12,18],[12,11,12,12],[12,13,13,13],[12,14,12,15],[11,7,11,9],[12,8,12,9],[11,5,13,6],[15,5,16,5],[27,5,28,5],[29,5,30,5],[17,5,18,5],[19,5,20,5],[21,5,22,5],[23,5,24,5],[25,5,26,5]]}
[]
[]
[]
[]
[]
[]
[]
[]
[null,null,null,null,null,"Список листов"]
[null,null,null,null,"Информация о ценах (тарифах) на регулируемые товары и услуги и надбавках к этим ценам (тарифам)"]
[]
[null,null,null,null,"№ п/п","Тариф на тепловую энергию / дифференциация по видам теплоносителя",null,"Организации-перепродавцы",null,null,"Бюджетные потребители",null,null,"Население",null,null,"Прочие",null,null,"Дата ввода","Срок действия (если установлен)","Постановление (от XX.XX.XXXX №)","Наименование регулирующего органа, принявшего решение об утверждении цен","Источник официального опубликования"]
[null,null,null,null,null,null,null,"Одноставочный тариф, руб./Гкал","Двухставочный тариф",null,"Одноставочный тариф, руб./Гкал","Двухставочный тариф",null,"Одноставочный тариф, руб./Гкал","Двухставочный тариф",null,"Одноставочный тариф, руб./Гкал","Двухставочный тариф"]
[null,null,null,null,null,null,null,null,"ставка за энергию руб./Гкал","ставка за мощность тыс.руб.в месяц/Гкал/ч",null,"ставка за энергию руб./Гкал","ставка за мощность тыс.руб.в месяц/Гкал/ч",null,"ставка за энергию руб./Гкал","ставка за мощность тыс.руб.в месяц/Гкал/ч",null,"ставка за энергию руб./Гкал","ставка за мощность тыс.руб.в месяц/Гкал/ч"]
[null,null,null,null,1,2,null,3,4,5,6,7,8,9,10,11,12,13,14,15,16,17,18,19]
[null,null,null,null,"1.1.1","Тариф без дифференциации по видам теплоносителя","через тепловую сеть",null,null,null,null,null,null,null,null,null,742.53,null,null,"2012-01-01",null,"от 22.12.2011 № 19/31","РЭК УР","rek-udm.ru"]
[null,null,null,null,"1.1.2",null,"отпуск с коллекторов"]
[null,null,null,null,"2.1.1","Горячая вода, в том числе","через тепловую сеть",null,null,null,null,null,null,null,null,null,{"$f":"Q16","v":742.53}]
[null,null,null,null,"2.1.2",null,"отпуск с коллекторов"]
[null,null,null,null,"3.1.1","Отборный пар всего, в том числе","через тепловую сеть"]
[null,null,null,null,"3.1.2",null,"отпуск с коллекторов"]
[null,null,null,null,"3.2.1","1,2-2,5 кг/см2","через тепловую сеть"]
[null,null,null,null,"3.2.2",null,"отпуск с коллекторов"]
[null,null,null,null,"3.3.1","2,5-7 кг/см2","через тепловую сеть"]
[null,null,null,null,"3.3.2",null,"отпуск с коллекторов"]
[null,null,null,null,"3.4.1","7-13 кг/см2","через тепловую сеть"]
[null,null,null,null,"3.4.2",null,"отпуск с коллекторов"]
[null,null,null,null,"3.5.1","> 13 кг/см2","через тепловую сеть"]
[null,null,null,null,"3.5.2",null,"отпуск с коллекторов"]
[null,null,null,null,"4.1.1","Острый редуцированный пар, в том числе","через тепловую сеть"]
{"$rows_left_out":3}
{"sheet":"ТС цены (2)","index":4,"n_rows":22,"n_cols":11,"rows_kept":22,"cut":false,"hidden":false,"merged":[[9,4,9,7]]}
[]
[null,null,null,"Удалить"]
[]
[]
[]
[]
[]
[]
[null,null,null,null,null,"Список листов"]
[null,null,null,null,"Информация о ценах (тарифах) на регулируемые товары и услуги и надбавках к этим ценам (тарифам)"]
[]
[null,null,null,null,"№ п/п","Наименование показателя","Единица измерения","Значение"]
[null,null,null,null,1,2,3,4]
[null,null,null,null,"1","Утвержденная надбавка к ценам (тарифам) на тепловую энергию для потребителей","руб./Гкал",null,null,null,{"$f":"SUM(K15:K17)","v":0}]
[null,null,null,null,"1.1","Утвержденная надбавка к ценам (тарифам) на тепловую энергию для населения","руб./Гкал",null,null,null,{"$f":"IF(H15=\"\",0,1)","v":0}]
[null,null,null,null,"1.2","Утвержденная надбавка к ценам (тарифам) на тепловую энергию для бюджетных потребителей","руб./Гкал",null,null,null,{"$f":"IF(H16=\"\",0,1)","v":0}]
[null,null,null,null,"1.3","Утвержденная надбавка к ценам (тарифам) на тепловую энергию для прочих потребителей","руб./Гкал",null,null,null,{"$f":"IF(H17=\"\",0,1)","v":0}]
[null,null,null,null,"2","Утвержденная надбавка к тарифам регулируемых организаций на тепловую энергию","руб./Гкал"]
[null,null,null,null,"3","Утвержденная надбавка к тарифам регулируемых организаций на передачу тепловой энергии","руб./Гкал"]
[null,null,null,null,"4","Утвержденный тариф на подключение создаваемых (реконструируемых) объектов недвижимости к системе теплоснабжения","руб./Гкал ч"]
[null,null,null,null,"5","Утвержденный тариф регулируемых организаций на подключение к системе теплоснабжения","руб./Гкал ч"]
[null,null,null,null,"6","Утвержденный тариф на передачу тепловой энергии (мощности)","руб./Гкал"]

{"sheet":"ТС характеристики","index":5,"n_rows":17,"n_cols":7,"rows_kept":17,"cut":false,"hidden":false,"merged":[[9,4,9,6]]}
[]
[]
[]
[]
[]
[]
[]
[]
[null,null,null,null,null,"Список листов"]
[null,null,null,null,"Информация об основных потребительских характеристиках регулируемых товаров и услуг регулируемых организаций и их соответствии государственным и иным утвержденным стандартам качества"]
[]
[null,null,null,null,"№ п/п","Наименование показателя","Значение"]
[null,null,null,null,1,{"$f":"E13+1","v":2},{"$f":"F13+1","v":3}]
[null,null,null,null,1,"Количество аварий на системах теплоснабжения (единиц на км)",0]
[null,null,null,null,2,"Количество часов (суммарно за календарный год), превышающих допустимую продолжительность перерыва подачи тепловой энергии в отопительный период",0]
[null,null,null,null,3,"Количество потребителей, затронутых ограничениями подачи тепловой энергии ",0]
[null,null,null,null,4,"Количество часов (суммарно за календарный год) отклонения от нормативной температуры воздуха по вине регулируемой организации в жилых и нежилых отапливаемых помещениях",0]

{"sheet":"ТС инвестиции","index":6,"n_rows":53,"n_cols":12,"rows_kept":53,"cut":false,"hidden":false,"merged":[[9,4,9,6]]}
[]
[]
[]
[]
[]
[]
[]
[]
[null,null,null,null,null,"Список листов"]
[null,null,null,null,"Информация об инвестиционных программах и отчетах об их реализации"]
[]
[null,null,null,null,"№ п/п","Наименование показателя","Значение","Плановые значения"]
[null,null,null,null,1,{"$f":"E13+1","v":2},{"$f":"F13+1","v":3},{"$f":"G13+1","v":4}]
[null,null,null,null,1,"Наименование инвестиционной программы",null,"х",null,"Введите название мероприятия",null,"Добавить мероприятие"]
[null,null,null,null,2,"Цель инвестиционной программы",null,"х",null,"х"]
[null,null,null,null,3,"Срок начала",null,"х",null,"х"]
[null,null,null,null,4,"Срок окончания",null,"х",null,"х"]
[null,null,null,null,5,"Потребность в финансовых средствах, необходимых для реализации инвестиционной программы",null,"х",null,"х"]
[null,null,null,null,"6","Инвестиционная программа продолжается в следующих периодах",null,"х",null,"х"]
[null,null,null,null,"7","Эффективность реализации инвестиционной программы:",{"$f":"SUM(J20:K20)","v":0},null,null,{"$f":"SUM(J21:J30)","v":0}]
[null,null,null,null,"7.1","Повышение уровня автоматизации (%)",0]
[null,null,null,null,"7.2","Повышение качества предоставляемых товаров/услуг (%)",0]
[null,null,null,null,"7.3","Снижение аварийности (%)",0]
[null,null,null,null,"7.4","Снижения % утечек",0]
[null,null,null,null,"7.5","Повышение эффективности работы (%)",0]
[null,null,null,null,"7.6","Повышение эффективности производства (%)",0]
[null,null,null,null,"7.7","Повышение качества учета товара/услуги (%)",0]
[null,null,null,null,"7.8","Прочие, при условии минимизация расходов (%)",0]
[null,null,null,null,"7.9",null,0]
[null,null,null,null,null,"Добавить показатель эффективности"]
{"$rows_left_out":24}
{"sheet":"ТС доступ","index":7,"n_rows":21,"n_cols":7,"rows_kept":21,"cut":false,"hidden":false,"merged":[[9,4,9,6]]}
[]
[]
[]
[]
[]
[]
[]
[]
[null,null,null,null,null,"Список листов"]
[null,null,null,null,"Информация о наличии (отсутствии) технической возможности доступа к регулируемым товарам и услугам регулируемых организаций, а также о регистрации и ходе реализации заявок на подключение к системе теплоснабжения"]
[]
[null,null,null,null,"№ п/п","Наименование показателя","Значение"]
[null,null,null,null,1,{"$f":"E13+1","v":2},{"$f":"F13+1","v":3}]
[null,null,null,null,1,"Количество поданных заявок на подключение к системе теплоснабжения"]
[null,null,null,null,"1.1","Количество зарегистрированных заявок на подключение к системе теплоснабжения (если отличается от количества поданных) "]
[null,null,null,null,2,"Количество исполненных заявок на подключение к системе теплоснабжения"]
[null,null,null,null,3,"Количество заявок на подключение к системе теплоснабжения, по которым принято решение об отказе в подключении"]
[null,null,null,null,4,"Резерв мощности системы теплоснабжения Всего (Гкал/час)",{"$f":"SUM(G19:G20)","v":0}]
[null,null,null,"first"]
[null,null,null,"end",null,"Добавить систему теплоснабжения"]
[null,null,null,null,5,"Справочно: количество выданных техусловий на подключение"]

{"sheet":"ТС показатели","index":8,"n_rows":65,"n_cols":10,"rows_kept":65,"cut":false,"hidden":false,"merged":[[51,5,51,6],[48,5,48,6],[42,5,42,6],[57,5,57,6],[54,5,54,6],[47,5,47,6],[49,5,49,6],[50,5,50,6],[53,5,53,6],[55,5,55,6],[56,5,56,6],[52,5,52,6],[46,5,46,6],[43,5,43,6],[45,5,45,6],[44,5,44,6],[64,5,64,6],[58,5,58,6],[59,5,59,6],[60,5,60,6],[61,5,61,6],[63,5,63,6],[62,5,62,6],[39,5,39,6],[36,5,36,6],[37,5,37,6],[38,5,38,6],[41,5,41,6],[40,5,40,6],[35,5,35,6],[27,5,27,6],[30,5,30,6],[31,5,31,6],[32,5,32,6],[28,5,28,6],[29,5,29,6],[33,5,33,6],[34,5,34,6],[24,5,24,6],[25,5,25,6],[26,5,26,6],[9,4,9,8],[18,4,21,4],[18,5,21,5],[13,5,13,6],[14,5,14,6],[15,5,15,6],[16,5,16,6],[17,5,17,6],[12,5,12,6],[11,5,11,6],[23,5,23,6]]}
[]
[]
[]
[]
[]
[]
[]
[]
[null,null,null,null,null,"Список листов"]
[null,null,null,null,"Информация об основных показателях финансово-хозяйственной деятельности регулируемых организаций, включая структуру основных производственных затрат (в части регулируемой деятельности)"]
[]
[null,null,null,null,"№ п/п","Наименование показателя",null,"Единица измерения","Значение"]
[null,null,null,null,1,{"$f":"E13+1","v":2},null,{"$f":"F13+1","v":3},{"$f":"H13+1","v":4}]
[null,null,null,null,1,"Вид регулируемой деятельности (производство, передача и сбыт тепловой энергии)",null,"x","производство (некомбинированная выработка)+передача"]
[null,null,null,null,2,"Выручка от регулируемой деятельности",null,"тыс.руб.",24395.45]
[null,null,null,null,3,"Себестоимость производимых товаров (оказываемых услуг) по регулируемому виду деятельности, в том числе:",null,"тыс.руб.",{"$f":"SUM(I17,I18,I24,I27,I28,I29,I30,I31,I32,I33,I36,I39,I40)","v":24335.45}]
[null,null,null,null,"3.1","Расходы на покупаемую тепловую энергию (мощность)",null,"тыс.руб."]
[null,null,null,null,"3.2","Расходы на топливо",null,"тыс.руб.",{"$f":"SUMIF(G19:G23,G19,I19:I23)","v":17925.330000000002}]
[null,null,null,null,"3.2.1","прочее","Стоимость","тыс.руб.",{"$f":"13905.52+4019.81","v":17925.330000000002}]
[null,null,null,null,null,null,"Объем","Гкал",{"$f":"29483+7000","v":36483},{"$f":"ISNA(J21)","v":false}]
[null,null,null,null,null,null,"Стоимость 1й единицы объема с учетом доставки (транспортировки)","тыс.руб.",{"$f":"IF(I20=\"\",0,IF(I20=0,0,I19/I20))","v":0.49133377189375876},{"$f":"INDEX(tech!G$24:G$51,MATCH(F19,tech!F$24:F$51,0))","v":0}]
[null,null,null,null,null,null,"Способ приобретения","x","транспортировка по паропроводам"]
[null,null,null,null,null,"Добавить вид топлива"]
[null,null,null,null,"3.3","Расходы на покупаемую электрическую энергию (мощность), потребляемую оборудованием, используемым в технологическом процессе:",null,"тыс.руб.",1775.5]
[null,null,null,null,"3.3.1","Средневзвешенная стоимость 1 кВт*ч",null,"руб.",{"$f":"IF(I26=0,0,I24/I26)","v":2.2844533652423409}]
[null,null,null,null,"3.3.2","Объем приобретенной электрической энергии",null,"тыс. кВт*ч",777.21]
[null,null,null,null,"3.4","Расходы на приобретение холодной воды, используемой в технологическом процессе",null,"тыс.руб.",168.05]
[null,null,null,null,"3.5","Расходы на химреагенты, используемые в технологическом процессе",null,"тыс.руб.",274.77]
[null,null,null,null,"3.6.1","   Расходы на оплату труда основного производственного персонала",null,"тыс.руб.",637.05999999999995]
[null,null,null,null,"3.6.2","   Отчисления на социальные нужды основного производственного персонала",null,"тыс.руб.",192.39]
{"$rows_left_out":36}
{"sheet":"Ссылки на публикации","index":9,"n_rows":28,"n_cols":7,"rows_kept":28,"cut":false,"hidden":false,"merged":[[26,4,26,6],[9,4,9,6],[11,4,11,6],[27,4,27,6]]}
[]
[]
[]
[]
[]
[]
[]
[]
[null,null,null,null,null,"Список листов"]
[null,null,null,null,"Ссылки на публикации в других источниках"]
[]
[null,null,null,null,"Условия публичных договоров поставок тепловой энергии, оказания услуг в сфере теплоснабжения, в том числе договоров на подключение к системе теплоснабжения и информация о порядке выполнения мероприятий, связанных с подключением"]
[null,null,null,null,"№ п/п","Содержание пункта","Ссылка на материалы"]
[null,null,null,null,1,{"$f":"E14+1","v":2},3]
[null,null,null,null,1,"Форма заявки на подключение к системе."]
[null,null,null,null,2,"Перечень и формы документов, представляемых одновременно с заявкой на подключение к системе."]
[null,null,null,null,3,"Описание (со ссылкой на нормативные акты) порядка действий  заявителя  и регулируемой организации при  подаче, приеме, обработке заявки на подключение к системе, принятии решения и уведомлении о принятом решении."]
[null,null,null,null,4,"Контакты службы, ответственной за прием и обработку заявок на подключение к системе."]
[null,null,null,null,"4.1","Адрес"]
[null,null,null,null,"4.2","Телефон"]
[null,null,null,null,"4.3","E-mail"]
[null,null,null,null,"4.4","Сайт"]
[null,null,null,"first",5,"Условия публичных договоров  поставок регулируемых товаров, оказания регулируемых услуг, в том числе договоров на подключение к системе *"]
[null,null,null,null,6,"Сведения об источнике публикации годовой бухгалтерской отчетности, включая бухгалтерский баланс и приложения к нему **"]
[null,null,null,"end",null,"Добавить запись"]
[]
[null,null,null,null,"* раскрывается на позднее 30 дней со дня соответствующего решения об установлении тарифа(надбавки) на очередной период регулирования "]
[null,null,null,null,"** заполняется в том случае, если выручка предприятия от регулируемой деятельности 80% и более от совокупной за отчетный год "]

{"sheet":"Проверка","index":10,"n_rows":1,"n_cols":3,"rows_kept":1,"cut":false,"hidden":false,"merged":[]}
["Ссылка","Причина","Статус ошибки"]

{"sheet":"REESTR_START","index":11,"n_rows":0,"n_cols":0,"rows_kept":0,"cut":false,"hidden":true,"merged":[]}

{"sheet":"REESTR_ORG","index":12,"n_rows":1,"n_cols":8,"rows_kept":1,"cut":false,"hidden":true,"merged":[]}
[null,"МР","МО","МО ОКТМО","ОРГАНИЗАЦИЯ","ИНН","КПП","ВИД ДЕЯТЕЛЬНОСТИ"]

{"sheet":"REESTR_TEMP","index":13,"n_rows":1,"n_cols":8,"rows_kept":1,"cut":false,"hidden":true,"merged":[]}
[null,"МР","МО","МО ОКТМО","ОРГАНИЗАЦИЯ","ИНН","КПП","ВИД ДЕЯТЕЛЬНОСТИ"]

{"sheet":"REESTR","index":14,"n_rows":1,"n_cols":3,"rows_kept":1,"cut":false,"hidden":true,"merged":[]}
["МО","МР","МР_ОКТМО"]

{"sheet":"TEHSHEET","index":15,"n_rows":84,"n_cols":4,"rows_kept":84,"cut":false,"hidden":true,"merged":[]}
["Алтайский край"]
["Амурская область","logical",null,"year_range"]
["Архангельская область","да",null,"2007"]
["Астраханская область","нет",null,"2008"]
["Белгородская область",null,null,"2009"]
["Брянская область",null,null,"2010"]
["Владимирская область",null,null,"2011"]
["Волгоградская область",null,null,"2012"]
["Вологодская область",null,null,"2013"]
["Воронежская область",null,null,"2014"]
["г. Москва",null,null,"2015"]
["г.Байконур",null,null,"2016"]
["г.Санкт-Петербург",null,null,"2017"]
["Еврейская автономная область",null,null,"2018"]
["Забайкальский край",null,null,"2019"]
["Ивановская область",null,null,"2020"]
["Иркутская область"]
["Кабардино-Балкарская республика","kind_of_activity"]
["Калининградская область","Передача+Сбыт"]
["Калужская область","Передача"]
["Камчатский край","производство комбинированная выработка"]
["Карачаево-Черкесская республика","производство (некомбинированная выработка)+передача+сбыт"]
["Кемеровская область","производство (некомбинированная выработка)+передача"]
["Кировская область","производство (некомбинированная выработка)+сбыт"]
["Костромская область","производство (некомбинированная выработка)"]
["Краснодарский край"]
["Красноярский край"]
["Курганская область"]
["Курская область"]
["Ленинградская область"]
{"$rows_left_out":55}
{"sheet":"tech","index":16,"n_rows":51,"n_cols":10,"rows_kept":51,"cut":false,"hidden":true,"merged":[[2,4,5,4],[2,5,5,5]]}
[]
[]
[null,null,null,null,null,null,"Стоимость","тыс.руб.",null,"Удалить"]
[null,null,null,null,null,null,"Объем",{"$f":"IF(J4,\"\",J5)","v":""},null,{"$f":"ISNA(J5)","v":true}]
[null,null,null,null,null,null,"Стоимость 1й единицы объема с учетом доставки (транспортировки)","тыс.руб.",{"$f":"IF(I4=\"\",0,IF(I4=0,0,I3/I4))","v":0},{"$f":"INDEX(tech!G$24:G$51,MATCH(F3,tech!F$24:F$51,0))","v":{"$error":"#N/A"}}]
[null,null,null,null,null,null,"Способ приобретения","x"]
[]
[]
[]
[]
[]
["et_price1_1"]
[]
[null,null,null,"Удалить теплоноситель"]
[]
["et_tsdostup_1"]
[]
[null,null,null,"Удалить теплоноситель"]
[]
["et_ssilki_1"]
[]
[]
[]
[]
[null,null,null,null,null,"газ природный","тыс. м3"]
[null,null,null,null,null,"газ сжиженный","кг"]
[null,null,null,null,null,"газовый конденсат","тонны"]
[null,null,null,null,null,"гшз","тонны"]
[null,null,null,null,null,"мазут","тонны"]
[null,null,null,null,null,"нефть","тонны"]
{"$rows_left_out":22}
{"sheet":"modHyp","index":17,"n_rows":0,"n_cols":0,"rows_kept":0,"cut":false,"hidden":true,"merged":[]}

{"sheet":"modChange","index":18,"n_rows":0,"n_cols":0,"rows_kept":0,"cut":false,"hidden":true,"merged":[]}

{"sheet":"modButtonClick","index":19,"n_rows":0,"n_cols":0,"rows_kept":0,"cut":false,"hidden":true,"merged":[]}

{"sheet":"modSubsidiary","index":20,"n_rows":0,"n_cols":0,"rows_kept":0,"cut":false,"hidden":true,"merged":[]}